"Titolo","Tipologia struttura","Descrizione","Immagine","Comune","Indirizzo","Telefono","Fax","E-mail","Sito web","Periodo apertura","Orario","Latitudine","Longitudine","Accessibile disabili"
"Bellamare","Camping","Il camping,con un estensione di 50.000mq, gode di una posizione incantevole direttamente sul mare. Particolare attenzione � data alla cura dei servizi. Lo staff d'animazione vi coinvolger� con divertenti programmi di giochi, spettacoli, attivit� sportive.",,"Porto Recanati",,"+39 071 976 628 - +39 336 631 715","+39 0 719 775 86","info@bellamare.it","http://www.bellamare.it",,,,,
"Il Vascello","Camping,Ristorante","Campeggio e ristorante sul mare , con annessi pizzeria e stabilimento balneare,tutto a conduziore familiare.",,"Porto Recanati",,"+39 071 759 132 2",,"elera82@hotmail.com",,,,,,
"Tutto Esaurito","Camping",,"http://turismo.comune.porto-recanati.mc.it/wp-content/blogs.dir/53/sites/53/Tutto-Esaurito.jpg","Porto Recanati",,"+39 071 759 244 2 - Inv. +39 0 733 549 540",,,"http://www.tuttoesaurito.biz/",,,"43.4103404","13.6741109",
"La Medusa","Camping","l Camping La Medusa ti offre la quiete e l'armonia delle colline che salgono verso Loreto e il suo magnifico Santuario e la serenit� e il divertimento della Riviera del Conero con il suo mare cristallino, per incorniciare il tuo soggiorno con meravigliosi paesaggi e indimenticabili emozioni. Abbiamo pensato a tutte le esigenze e le abbiamo inserite all'interno dei 80.000 metri quadrati di Camping La Medusa. Fatti coccolare nella nostra struttura, mantenendo la libert� e l'autonomia della vita di campeggio. COSA TI OFFRIAMO Campeggio fronte mare Ampio ed attrezzato parco giochiPiscinaSpiaggia privata attrezzata e spiaggia liberaInternet Point Animazione per tutte le et�All'interno del campeggio inoltre, troverai un comodo centro commerciale fornito di: Pizzeria con forno a legnaSelf serviceTabacchiGiornaliSupermarket GLI ALLOGGI Se ti piace la liberta' della vita in campeggio, ma non vuoi rinunciare alla comodita' di un alloggio con tutti i servizi, i bungalow di Camping La Medusa sono la soluzione ideale per la tua vacanza al mare con tutta la famiglia ! Comodita', raffinatezza, cura dei particolari : fiore all'occhiello delle nostre proposte sono le nuovissime mobilvilla che rappresentano il massimo dell'offerta di Camping La Medusa. Le mobilvilla sono l'ideale per chi desidera avere molto spazio e usufruire di tutte le comodita' come a casa propria. Le mobilvilla sono inserite in un ambiente giardino che assicura tranquillita' e massima privacy, inoltre sono tutte dotate di tv in camera e aria condizionata per regalarti momenti di vero relax anche nelle ore piu' calde della giornata. Se hai dei bambini o semplicemente, vuoi goderti al massimo la vacanza al mare vivendo in un ambiente comodo ed accogliente, scegli una delle 40 mobilvilla di Camping La Medusa. Ogni alloggio dispone di biancheria da letto e da bagno, servizio spiaggia con un ombrellone e 2 lettini. LE PIAZZOLE Se ti piace vivere la vacanza al mare in totale libert�, senza gli orari degli alberghi o i costi eccessivi degli appartamenti, le piazzole di Camping La Medusa sono la soluzione ideale per un soggiorno in libert�. ma con tutti i servizi delle migliori strutture. Il nostro campeggio dispone di piazzole ampie e al riparo di alberi o di teli ombreggianti, potrai usufruire dell'elettricit� e dei comodi servizi disposti all'interno del campeggio, attrezzati con tutto il necessario per i campeggiatori.","http://turismo.comune.porto-recanati.mc.it/wp-content/blogs.dir/53/sites/53/La-Medusa-150x150.jpg","Porto Recanati",,"+39 071 750 072 5",,"info@campinglamedusa.it","https://www.campinglamedusa.it/",,,"43.4666909","13.6431303",
"Paradise","Camping,Hotel","La nostra struttura mira a soddisfare i bisogni dei clienti che cercano una distensione e una vacanza tranquilla per la famiglia o per coppie. �� immersa in 40,000 metri quadri di verde in una zona verde ad appena una passeggiata dalla citt� di Porto R",,"Porto Recanati",,"+39 071 759 018 4","+39 071 920 305 0","info@paradisevacanze.com","https://www.paradisevacanze.com/",,,"43.4667517","13.6102996",
"Pineta","Camping","Caratteristico per la sua posizione privilegiata direttamente sul mare, nella Pineta di Porto Recanati, sorge una delle pi� belle strutture ricettive delle marche: IL CAMPING PINETA. Il parco si estende su una superficie di circa 29.000 mq. e dispone di circa 200 piazzole ombreggiate da pini secolari, pioppi e tamerici e di 50 piazzole direttamente sulla spiaggia libera (mista sabbia e ghiaia). Il Camping Pineta � situato in posizione strategica, in quanto dista soltanto 600 metri dal centro di Porto Recanati, rinomata cittadina turistica, facilmente raggiungibile a piedi, tramite un marciapiede pedonale, oppure tramite il servizio di navetta urbana attivo da Luglio a Settembre. La tranquillit� del parco unita alla vicinanza del paese offre al cliente un soggiorno di sicuro relax e divertimento. SERVIZI: 3 gruppi di servizi igienici con docce calde libere, prese per rasoi elettrici ed asciugacapelli, docce fredde esterne e interne, vuotatoi chimici, lavelli per biancheria divisi da quelli per le stoviglie. Sul gruppo di servizi a nord passibilit� di usufruire di 2 lavatrici a gettoni; camper service incluso nel prezzo del soggiorno. Servizi per disabili, parcheggio, lavanderia, bar, ristorante, pizzeria, supermarket, video game, parco giochi per bimbi , campo da calcetto, beach volley, bocce, animazione con staff qualificato per tutti. NOVITA': Baby Club dal 01.07 al 31.08, Castello per bambini e, in date prestabilite trenino per bambini. Nelle vicinanze. Pub, discoteche, gelaterie, bar, spiaggia attrezzata. BUNGALOW: bilocale piccolo (2/4 posti), medio (4 posti) e trilocale (5 posti), tutti con veranda coperta, bagno con doccia e cucina. APPARTAMENTI: Da 4 a 7 posti letto, sia al piano terra che al primo piano. UBICAZIONE: Direttamente sul mare. SPIAGGIA: Mista Di sabbia e ghiaia.","http://turismo.comune.porto-recanati.mc.it/wp-content/blogs.dir/53/sites/53/864-150x150.jpg","Porto Recanati",,"+39 071 979 9237",,"info@pinetacamping.it","https://www.pinetacamping.it/",,,"43.4155907","13.6712024",
"Camping Regina","Camping,Hotel","l camping Regina e' situato a Sud della splendida cittadina di Porto Recanati, in posizione tranquilla, panoramica e direttamente sul mare, con un'ampia spiaggia di ghiaia fina, raggiungibile tramite un sottopasso pedonale privato di 20mt. Il camping si estende su una superficie pianeggiante di circa 28.000 mq completamente immersi nel verde dei suoi pioppi e pini, offrendo ospitalit� a circa 1500 persone; dispone infatti di ampie piazzole per camper, caravan e tende, nonch� di bungalow in muratura sia bilocali che trilocali. E' dotato inoltre di reception, bar ristorante, pizzeria, piccolo spaccio per alimenti di prima necessit�, a solo 2 km dal centro abitato e a numerosi locali di svago, offre al cliente il giusto mix di relax e divertimento, con la possibilit� di unire a tutto ci� interessantissime escursioni di tipo panoramico, culturale ed enogastronomico. A 800 Mt dal campeggio, sono disponibili anche appartamenti direttamente sul mare, stessa propriet�. &nbsp; Piazzole Il camping dispone di circa 250 piazzole per caravan e tende tutte con ombra artificiale (teli ombreggianti) o naturale (pioppi e pini). Cisono 4 gruppi di servizi, anche con wc chimico, dislocati nei punti strategici del camping, con possibilit� di doccia fredda o calda libera. La parte centrale del camping e' strutturata con bar e ristoro e area ricreativa, dove ogni sera viene svolto il programma di animazione che prevede serate di karaoke, musica dal vivo, balli, circo per i bambini, film o cartoni animati. Bungalow Il camping Regina mette a disposizione dei propri ospiti 24 bungalow in muratura, bilocali o trilocali. Strutturati sia al piano terra che al primo piano dispongono tutti rispettivamente di veranda coperta o terrazzo e sono attrezzati con tavolo e seggiole per avere la possibilit� di mangiare anche all'aperto. I bungalow trilocali, per 4 o 5 persone sono tutti villini al piano terra, i bilocali per 3 o 4 persone sono invece dislocati sia al piano terra che al primo piano. Le abitazioni dispongono tutte cucina camera/e, e bagno interno con doccia calda. APPARTAMENTI a 800 mt.: da 4 a 6 posti letto. Servizi Bar, Ristorante, Pizzeria, sala giochi, parco giochi, campo da bocce, campo da calcetto, campo da tennis, lavanderia, intrattenimenti serali.Il bar e' attrezzato con piccolo spaccio di generi di prima necessita' (pane pasta, latte e affettati) e viene svolto servizio di frutta e verdura ambulante 3 volte la settimana. Nelle vicinanze: spiaggia attrezzata (scontata per i clienti del campeggio), parco acquatico, porto turistico, discoteca, pubs.","http://turismo.comune.porto-recanati.mc.it/wp-content/blogs.dir/53/sites/53/852-150x150.jpg","Porto Recanati",,"+39 071 7591 303 -  + 39 339 453 563 5",,"info@campingregina.it","http://www.campingregina.it",,,,,
"Adriatico","Camping",,,"Porto Recanati",,"+39 071 977 735 - Inv. +39 071 3 437 1","+39 071 977 735","cca@campeggioclubadriatico.it","http://www.campeggioclubadriatico.it/",,,"43.4617566","13.6341826",
"Campeggio Arcobaleno","Camping",,,"Porto Recanati",,"+ 39 071 759 244 2  + 39 0733 549 540",,,,,,,,
